{"text_format":"1","workbook":"xlsx","n_sheets":3,"sheets":["Taul1","Taul2","Taul3"],"not_rendered":{"charts":0,"images":0,"macros":0,"external_links":0,"defined_names":0,"comments":0,"pivot_tables":0},"unopened":[],"bounds":{"document_bytes":16777216,"sheet_cells":100000,"rows_first":2000,"rows_last":500,"rows_between":2000,"halvings":0,"cell_chars":16384,"cell_head_chars":4096},"cells_cut":0,"cells_raw":0,"read":"whole","date_system":"1900"}

{"sheet":"Taul1","index":0,"n_rows":35,"n_cols":46,"rows_kept":35,"cut":false,"hidden":false,"merged":[]}
["Sotilasurheiluliiton Kamppailupäivät Victorinox Games - JUDO 2016 "]
[null,null,null,"PRONSSI",null,null,1,"pistettä",null,null,null,null,null,"HOPEA",null,null,3,"pistettä",null,null,null,null,null,"KULTA",null,null,5,"pistettä"]
[null,null,"Miehet-60 kg",null,null,null,null,"Miehet-66 kg",null,null,null,null,"Miehet-73 kg",null,null,null,null,"Miehet-81 kg",null,null,null,null,"Miehet-90 kg",null,null,null,null,"Miehet+90 kg",null,null,null,null,"Miehet-avoin ",null,null,null,null,"MH-75 kg",null,null,null,null,"MH+75 kg"]
["JOUKKO-OSASTOT ","YHTPIST.",3,3,2,1,null,3,3,2,1,null,3,3,2,1,null,3,3,2,1,null,3,3,2,1,null,3,3,2,1,null,3,3,2,1,null,3,3,3,1,null,3,3,2,1]
["KAJVU",{"$f":"SUM(C5:AT5)","v":0}]
["HÄMVU",{"$f":"SUM(C6:AT6)","v":1},null,null,null,null,null,null,null,null,null,null,null,null,null,null,null,null,null,null,null,null,null,null,null,null,null,null,null,null,null,null,null,null,null,null,null,null,1]
["HELVU",32,null,null,null,null,null,null,null,null,null,null,null,null,3,5,null,null,null,null,null,null,null,1,null,5,null,null,null,null,null,null,null,null,null,null,null,1,null,3,5,null,1,null,3,5]
["DRI",0]
["SODVU",1,null,null,null,null,null,null,null,null,null,null,null,1]
["RUK",1,null,null,null,null,null,null,null,null,null,null,1]
["KOUVU",3,null,null,null,null,null,null,null,null,null,null,null,null,null,null,null,null,null,null,null,null,null,null,3]
["ROVVU",0]
["PORKVU",1,null,null,null,null,null,null,null,null,null,null,null,null,null,null,null,null,null,null,null,null,null,null,null,null,null,null,null,null,null,null,null,null,null,null,null,null,null,null,null,null,null,1]
[null,0]
[null,0]
[null,0]
[null,0]
[null,0]
[null,0]
[null,0]
[null,0]
[null,0]
[null,0]
[null,0]
[]
["Pisteitä yht",{"$f":"SUM(B5:B24)","v":39},{"$f":"SUM(C5:C24)","v":0},{"$f":"SUM(D5:D24)","v":0},{"$f":"SUM(E5:E24)","v":0},{"$f":"SUM(F5:F24)","v":0},null,{"$f":"SUM(H5:H24)","v":0},{"$f":"SUM(I5:I24)","v":0},{"$f":"SUM(J5:J24)","v":0},{"$f":"SUM(K5:K24)","v":0},null,{"$f":"SUM(M5:M24)","v":1},{"$f":"SUM(N5:N24)","v":1},{"$f":"SUM(O5:O24)","v":3},{"$f":"SUM(P5:P24)","v":5},null,{"$f":"SUM(R5:R24)","v":0},{"$f":"SUM(S5:S24)","v":0},{"$f":"SUM(T5:T24)","v":0},{"$f":"SUM(U5:U24)","v":0},null,{"$f":"SUM(W5:W24)","v":0},{"$f":"SUM(X5:X24)","v":1},{"$f":"SUM(Y5:Y24)","v":3},{"$f":"SUM(Z5:Z24)","v":5},null,{"$f":"SUM(AB5:AB24)","v":0},{"$f":"SUM(AC5:AC24)","v":0},{"$f":"SUM(AD5:AD24)","v":0},{"$f":"SUM(AE5:AE24)","v":0},null,{"$f":"SUM(AG5:AG24)","v":0},{"$f":"SUM(AH5:AH24)","v":0},{"$f":"SUM(AI5:AI24)","v":0},{"$f":"SUM(AJ5:AJ24)","v":0},null,{"$f":"SUM(AL5:AL24)","v":1},{"$f":"SUM(AM5:AM24)","v":1},{"$f":"SUM(AN5:AN24)","v":3},{"$f":"SUM(AO5:AO24)","v":5},null,{"$f":"SUM(AQ5:AQ24)","v":1},{"$f":"SUM(AR5:AR24)","v":1},{"$f":"SUM(AS5:AS24)","v":3},{"$f":"SUM(AT5:AT24)","v":5}]
["Tarkistus onko virheitä = V",{"$f":"SUM(B6:B25)","v":39},{"$f":"IF(C26=$G$2,\"\",\"V\")","v":"V"},{"$f":"IF(D26=$G$2,\"\",\"V\")","v":"V"},{"$f":"IF(E26=$Q$2,\"\",\"V\")","v":"V"},{"$f":"IF(F26=$AA$2,\"\",\"V\")","v":"V"},null,{"$f":"IF(H26=$G$2,\"\",\"V\")","v":"V"},{"$f":"IF(I26=$G$2,\"\",\"V\")","v":"V"},{"$f":"IF(J26=$Q$2,\"\",\"V\")","v":"V"},{"$f":"IF(K26=$AA$2,\"\",\"V\")","v":"V"},null,{"$f":"IF(M26=$G$2,\"\",\"V\")","v":""},{"$f":"IF(N26=$G$2,\"\",\"V\")","v":""},{"$f":"IF(O26=$Q$2,\"\",\"V\")","v":""},{"$f":"IF(P26=$AA$2,\"\",\"V\")","v":""},null,{"$f":"IF(R26=$G$2,\"\",\"V\")","v":"V"},{"$f":"IF(S26=$G$2,\"\",\"V\")","v":"V"},{"$f":"IF(T26=$Q$2,\"\",\"V\")","v":"V"},{"$f":"IF(U26=$AA$2,\"\",\"V\")","v":"V"},null,{"$f":"IF(W26=$G$2,\"\",\"V\")","v":"V"},{"$f":"IF(X26=$G$2,\"\",\"V\")","v":""},{"$f":"IF(Y26=$Q$2,\"\",\"V\")","v":""},{"$f":"IF(Z26=$AA$2,\"\",\"V\")","v":""},null,{"$f":"IF(AB26=$G$2,\"\",\"V\")","v":"V"},{"$f":"IF(AC26=$G$2,\"\",\"V\")","v":"V"},{"$f":"IF(AD26=$Q$2,\"\",\"V\")","v":"V"},{"$f":"IF(AE26=$AA$2,\"\",\"V\")","v":"V"},null,{"$f":"IF(AG26=$G$2,\"\",\"V\")","v":"V"},{"$f":"IF(AH26=$G$2,\"\",\"V\")","v":"V"},{"$f":"IF(AI26=$Q$2,\"\",\"V\")","v":"V"},{"$f":"IF(AJ26=$AA$2,\"\",\"V\")","v":"V"},null,{"$f":"IF(AL26=$G$2,\"\",\"V\")","v":""},{"$f":"IF(AM26=$G$2,\"\",\"V\")","v":""},{"$f":"IF(AN26=$Q$2,\"\",\"V\")","v":""},{"$f":"IF(AO26=$AA$2,\"\",\"V\")","v":""},null,{"$f":"IF(AQ26=$G$2,\"\",\"V\")","v":""},{"$f":"IF(AR26=$G$2,\"\",\"V\")","v":""},{"$f":"IF(AS26=$Q$2,\"\",\"V\")","v":""},{"$f":"IF(AT26=$AA$2,\"\",\"V\")","v":""}]
[]
[]
["Syöttö ohjeet","Pronssi2 ei jaetta",null,null,0,"(aiheuttaa tarkistusriville V merkin)"]
[null,"Pronssi",null,null,1]
[null,"Hopea",null,null,3]
[null,"Kulta",null,null,5]
[null,null,null,null,null,null,null,null,null,null,null,null,null,null,null,null,0]
["Tarkistusrivi virhe","V"]

{"sheet":"Taul2","index":1,"n_rows":0,"n_cols":0,"rows_kept":0,"cut":false,"hidden":false,"merged":[]}

{"sheet":"Taul3","index":2,"n_rows":0,"n_cols":0,"rows_kept":0,"cut":false,"hidden":false,"merged":[]}